Target
Adenosine receptor A3
Ligand
BDBM434795
Substrate
Meas. Tech.
Binding Assays
Ki
0.620±0.06 nM
Citation
 Jacobson, KATosh, DKSalvemini, D A3 adenosine receptor agonists US Patent  US10577368 Publication Date 3/3/2020 
Target
Name:
Adenosine receptor A3
Synonyms:
A3 adenosine receptor (hA3) ADORA3 | Adenosine A3 receptor (A3AR)
Type:
G Protein-Coupled Receptor (GPCR)
Mol. Mass.:
36197.32
Organism:
Homo sapiens (Human)
Description:
P0DMS8
Residue:
318
  
Inhibitor
Name:
BDBM434795
Synonyms:
US10577368, Compound 17
Type:
Small organic molecule
Emp. Form.:
C20H20N6O4
Mol. Mass.:
408.4106
SMILES:
CNC(=O)[C@]12CC1[C@H]([C@H](O)C2O)n1cnc2c(NC)nc(nc12)C#Cc1ccco1
: