Target
Tyrosine-protein kinase BTK
Ligand
BDBM164717
Substrate
Meas. Tech.
Btk Enzyme Assay
pH
7.4±n/a
Temperature
298.15±n/a K
IC50
0.10±n/a nM
Comments
extracted
Citation
 Liu, QWatterson, SHAhmad, S Indole carboxamide compounds US Patent  US9688629 Publication Date 6/27/2017 
Target
Name:
Tyrosine-protein kinase BTK
Synonyms:
AGMX1 Agammaglobulinaemia tyrosine kinase B cell progenitor kinase BPK BTK_HUMAN Tyrosine Kinase BTK Tyrosine-protein kinase BTK (BTK)
Type:
Enzyme
Mol. Mass.:
76289.95
Organism:
Homo sapiens (Human)
Description:
Q06187
Residue:
659
  
Inhibitor
Name:
BDBM164717
Synonyms:
US10604504, Example 160 US9688629, 159 US9802915, Example 160 | US9920031, Example 160
Type:
Small organic molecule
Emp. Form.:
C21H25FN4O2
Mol. Mass.:
384.4472
SMILES:
Cc1[nH]c2c(cc(F)c(N3CC4CCCN(C4C3)C(=O)C=C)c2c1C)C(N)=O
: