Target
Tyrosine-protein kinase BTK
Ligand
BDBM166831
Substrate
Meas. Tech.
Btk Enzyme Assay
pH
7.4±n/a
Temperature
298.15±n/a K
IC50
0.10±n/a nM
Comments
extracted
Citation
 Liu, QWatterson, SHAhmad, S Indole carboxamide compounds US Patent  US9688629 Publication Date 6/27/2017 
Target
Name:
Tyrosine-protein kinase BTK
Synonyms:
AGMX1 Agammaglobulinaemia tyrosine kinase B cell progenitor kinase BPK BTK_HUMAN Tyrosine Kinase BTK Tyrosine-protein kinase BTK (BTK)
Type:
Enzyme
Mol. Mass.:
76289.95
Organism:
Homo sapiens (Human)
Description:
Q06187
Residue:
659
  
Inhibitor
Name:
BDBM166831
Synonyms:
US10604504, Example 242 US9688629, 242 US9920031, Example 242
Type:
Small organic molecule
Emp. Form.:
C19H21FN4O2
Mol. Mass.:
356.394
SMILES:
Cc1[nH]c2c(cc(F)c(N3CCC[C@@H](C3)NC(=O)C#C)c2c1C)C(N)=O
: