Target
Cyclin-dependent kinase 4
Ligand
BDBM148264
Substrate
Meas. Tech.
Inhibition Assay
IC50
2.14±n/a nM
Citation
 Wang, SChen, KLiu, XHu, YLiu, BPeng, YLuo, HHan, YWang, SLiu, MXu, H Substituted pyrrolopyrimidine CDK inhibitor, pharmaceutical composition containing same and use thereof US Patent  US10570141 Publication Date 2/25/2020 
Target
Name:
Cyclin-dependent kinase 4
Synonyms:
CDK4 Cell division protein kinase 4 PSK-J3
Type:
Enzyme Subunit
Mol. Mass.:
33731.96
Organism:
Homo sapiens (Human)
Description:
P11802
Residue:
303
  
Inhibitor
Name:
BDBM148264
Synonyms:
7-cyclopentyl-N,N-dimethyl-2-((5-(piperazin-1-yl)pyridin-2-yl)amino)-7H-pyrrolo[2,3-d]pyrimidine-6-carboxamide LEE011 US10570141, Comparative Example 1 | US8962630, 74
Type:
Small organic molecule
Emp. Form.:
C23H30N8O
Mol. Mass.:
434.5373
SMILES:
CN(C)C(=O)c1cc2cnc(Nc3ccc(cn3)N3CCNCC3)nc2n1C1CCCC1
: