Target
Fibroblast growth factor receptor 2
Ligand
BDBM261949
Substrate
Meas. Tech.
Enzymatic Assay
IC50
20±n/a nM
Citation
 Sokolsky, AWu, LYao, W Bicyclic heterocycles as FGFR4 inhibitors US Patent  US10632126 Publication Date 4/28/2020 
Target
Name:
Fibroblast growth factor receptor 2
Synonyms:
BEK FGFR-2 FGFR2 Fibroblast growth factor receptor 2 (FGFR2) KGFR Keratinocyte growth factor receptor VEGF-receptor 2 and Fibroblast growth factor receptor 2
Type:
Enzyme
Mol. Mass.:
92015.45
Organism:
Homo sapiens (Human)
Description:
P21802
Residue:
821
  
Inhibitor
Name:
BDBM261949
Synonyms:
3-(2,6-difluoro-3,5-dimethoxyphenyl)-1-ethyl-7-(3-methyl-1-(pyridin-3-ylmethyl)-1H-pyrazol-4-yl)-3,4-dihydropyrido[4,3-d]pyrimidin-2(1H)-one US10632126, Example 50 US9708318, 50
Type:
Small organic molecule
Emp. Form.:
C27H26F2N6O3
Mol. Mass.:
520.5305
SMILES:
CCN1C(=O)N(Cc2cnc(cc12)-c1cn(Cc2cccnc2)nc1C)c1c(F)c(OC)cc(OC)c1F
: