Target
Fibroblast growth factor receptor 4
Ligand
BDBM261964
Substrate
Meas. Tech.
Enzymatic Assay
IC50
115±n/a nM
Citation
 Sokolsky, AWu, LYao, W Bicyclic heterocycles as FGFR4 inhibitors US Patent  US10632126 Publication Date 4/28/2020 
Target
Name:
Fibroblast growth factor receptor 4
Synonyms:
CD_antigen: CD334 FGFR4 FGFR4 Fibroblast growth factor receptor JK2 TKF
Type:
Protein
Mol. Mass.:
87957.45
Organism:
Homo sapiens (Human)
Description:
P22455
Residue:
802
  
Inhibitor
Name:
BDBM261964
Synonyms:
3-(2,6-difluoro-3,5- dimethoxyphenyl)-7-(1,3- dimethyl-1H-pyrazol-4-yl)-1- ((5-ethylisoxazol-3-yl)methyl)- 3,4-dihydropyrido[4,3- d]pyrimidin-2(1H)-one US10632126, Example 64 US9708318, 64
Type:
Small organic molecule
Emp. Form.:
C26H26F2N6O4
Mol. Mass.:
524.5192
SMILES:
CCc1cc(CN2C(=O)N(Cc3cnc(cc23)-c2cn(C)nc2C)c2c(F)c(OC)cc(OC)c2F)no1
: