Target
Fibroblast growth factor receptor 4
Ligand
BDBM261969
Substrate
Meas. Tech.
Enzymatic Assay
IC50
115±n/a nM
Citation
 Sokolsky, AWu, LYao, W Bicyclic heterocycles as FGFR4 inhibitors US Patent  US10632126 Publication Date 4/28/2020 
Target
Name:
Fibroblast growth factor receptor 4
Synonyms:
CD_antigen: CD334 FGFR4 FGFR4 Fibroblast growth factor receptor JK2 TKF
Type:
Protein
Mol. Mass.:
87957.45
Organism:
Homo sapiens (Human)
Description:
P22455
Residue:
802
  
Inhibitor
Name:
BDBM261969
Synonyms:
US10251892, Example 69 US11173162, Example 69 | US9708318, 69
Type:
Small organic molecule
Emp. Form.:
C26H24F2N6O3
Mol. Mass.:
506.504
SMILES:
COc1cc(OC)c(F)c(N2Cc3cnc(cc3N(Cc3ccncc3)C2=O)-c2cn(C)nc2C)c1F
: