Target
Fibroblast growth factor receptor 1
Ligand
BDBM262061
Substrate
Meas. Tech.
Enzymatic Assay
IC50
20±n/a nM
Citation
 Sokolsky, AWu, LYao, W Bicyclic heterocycles as FGFR4 inhibitors US Patent  US10632126 Publication Date 4/28/2020 
Target
Name:
Fibroblast growth factor receptor 1
Synonyms:
BFGFR Basic fibroblast growth factor receptor 1 (FGFR1) CEK FGFR-1 FGFR-1, (FL) FGFR1_HUMAN FLT2 Fibroblast growth factor receptor 1 (FGFR-1) Fms-like tyrosine kinase 2 N-sam bFGF-R | c-fgr
Type:
Receptor
Mol. Mass.:
91861.70
Organism:
Homo sapiens (Human)
Description:
P11362
Residue:
822
  
Inhibitor
Name:
BDBM262061
Synonyms:
5-(3-(2,6-difluoro-3,5-dimethoxyphenyl)-1-ethyl-2-oxo-1,2,3,4-tetrahydropyrido[4,3-d]pyrimidin-7-yl)-N-propylpicolinamide US10632126, Example 179 US9708318, 179
Type:
Small organic molecule
Emp. Form.:
C26H27F2N5O4
Mol. Mass.:
511.5205
SMILES:
CCCNC(=O)c1ccc(cn1)-c1cc2N(CC)C(=O)N(Cc2cn1)c1c(F)c(OC)cc(OC)c1F
: