Target
Replicase polyprotein 1ab
Ligand
BDBM49122
Substrate
Meas. Tech.
Hit profiling assay without DTT
IC50
140±n/a nM
Citation
 Kuzikov, MCostanzi, EReinshagen, JEsposito, FVangeel, LWolf, MEllinger, BClaussen, CGeisslinger, GCorona, AIaconis, DTalarico, CManelfi, CCannalire, RRossetti, GGossen, JAlbani, SMusiani, FHerzog, KYe, YGiabbai, BDemitri, NJochmans, DDe Jonghe, SRymenants, JSumma, VTramontano, EBeccari, ARLeyssen, PStorici, PNeyts, JGribbon, PZaliani, A Identification of inhibitors of SARS-CoV-2 3CL-Pro enzymatic activity using a small molecule in-vitro repurposing screen bioRxiv 2020:0 (2020)    Article 
Target
Name:
Replicase polyprotein 1ab
Synonyms:
ORF1ab polyprotein pp1ab | rep
Type:
Protein
Mol. Mass.:
794070.71
Organism:
2019-nCoV
Description:
P0DTD1
Residue:
7096
  
Inhibitor
Name:
BDBM49122
Synonyms:
2-amino-3-hydroxy-N'-(2,3,4-trihydroxybenzyl)propionohydrazide;hydrochloride 2-azanyl-3-oxidanyl-N'-[[2,3,4-tris(oxidanyl)phenyl]methyl]propanehydrazide;hydrochloride Benserazide SMR000058421 | cid_26964
Type:
Small organic molecule
Emp. Form.:
C10H15N3O5
Mol. Mass.:
257.2432
SMILES:
NC(CO)C(=O)NNCc1ccc(O)c(O)c1O
: