Target
Replicase polyprotein 1ab
Ligand
BDBM442796
Substrate
Meas. Tech.
Coronavirus 3C Protease FRET Assay
EC50
8.00e+5±n/a nM
Citation
 Kania, RSJr., LJNieman, JA Anticoronaviral compounds and compositions, their pharmaceutical uses and materials for their synthesis WIPO 0:0 (2006) Target
Name:
Replicase polyprotein 1ab
Synonyms:
C3 like protease | nonstructural polyprotein pp1ab
Type:
Mol. Mass.:
790278.87
Organism:
SARS coronavirus Urbani
Description:
Residue:
7073
  
Inhibitor
Name:
BDBM442796
Synonyms:
WO2006061714, P38.1
Type:
Small organic molecule
Emp. Form.:
C24H34N4O6
Mol. Mass.:
474.55
SMILES:
COC(O)[C@H](C[C@@H]1CCNC1=O)NC(=O)[C@H](CC(C)C)NC(=O)c1cc2c(OC)cccc2[nH]1
: