Target
Replicase polyprotein 1ab
Ligand
BDBM423465
Substrate
Meas. Tech.
Coronavirus 3C Protease FRET Assay
IC50
20000±0 nM
EC50
4200000±n/a nM
Citation
 Kania, RSJr., LJNieman, JA Anticoronaviral compounds and compositions, their pharmaceutical uses and materials for their synthesis WIPO 0:0 (2006) Target
Name:
Replicase polyprotein 1ab
Synonyms:
C3 like protease | nonstructural polyprotein pp1ab
Type:
Mol. Mass.:
790278.87
Organism:
SARS coronavirus Urbani
Description:
Residue:
7073
  
Inhibitor
Name:
BDBM423465
Synonyms:
US11753373, Compound A-1-c WO2006061714-ID-10 | cmdc.202100576, 10b
Type:
Small Organic Molecule
Emp. Form.:
C22H28N4O4
Mol. Mass.:
412.4821
SMILES:
CC(C)C[C@H](NC(=O)c1cc2ccccc2[nH]1)C(=O)N[C@@H](C[C@@H]1CCNC1=O)C=O
: