Target
Replicase polyprotein 1ab
Ligand
BDBM423467
Substrate
Meas. Tech.
Coronavirus 3C Protease FRET Assay
IC50
68000000±0 nM
Citation
 Kania, RSJr., LJNieman, JA Anticoronaviral compounds and compositions, their pharmaceutical uses and materials for their synthesis WIPO 0:0 (2006) Target
Name:
Replicase polyprotein 1ab
Synonyms:
C3 like protease | nonstructural polyprotein pp1ab
Type:
Mol. Mass.:
790278.87
Organism:
SARS coronavirus Urbani
Description:
Residue:
7073
  
Inhibitor
Name:
BDBM423467
Synonyms:
WO2006061714, P39.2 | WO2006061714-ID-12
Type:
Small Organic Molecule
Emp. Form.:
C26H40N4O6
Mol. Mass.:
504.619
SMILES:
CC(C)C[C@H](NC(=O)[C@@H](NC(=O)OCc1ccccc1)C(C)C)C(=O)N[C@H](CO)C[C@@H]1CCNC1=O
: