Target
Replicase polyprotein 1ab
Ligand
BDBM423469
Substrate
Meas. Tech.
Coronavirus 3C Protease FRET Assay
IC50
50000±0 nM
EC50
18000000±n/a nM
Citation
 Kania, RSJr., LJNieman, JA Anticoronaviral compounds and compositions, their pharmaceutical uses and materials for their synthesis WIPO 0:0 (2006) Target
Name:
Replicase polyprotein 1ab
Synonyms:
C3 like protease | nonstructural polyprotein pp1ab
Type:
Mol. Mass.:
790278.87
Organism:
SARS coronavirus Urbani
Description:
Residue:
7073
  
Inhibitor
Name:
BDBM423469
Synonyms:
WO2006061714, P39.4 cmdc.202100576, 10e
Type:
Small Organic Molecule
Emp. Form.:
C23H32N4O5
Mol. Mass.:
444.524
SMILES:
COc1cccc2[nH]c(cc12)C(=O)N[C@@H](CC(C)C)C(=O)N[C@@H](CCC(=O)N(C)C)C=O
: