Target
Monoacylglycerol lipase ABHD6
Ligand
BDBM444434
Substrate
Meas. Tech.
Fluorescent Assay
IC50
55±n/a nM
Citation
 Makriyannis, AMalamas, MLamani, MFarah, SI ABHD6 and dual ABHD6/MGL inhibitors and their uses US Patent  US10662159 Publication Date 5/26/2020 
Target
Name:
Monoacylglycerol lipase ABHD6
Synonyms:
2-arachidonoylglycerol hydrolase ABHD6_HUMAN Monoacylglycerol lipase ABHD6
Type:
PROTEIN
Mol. Mass.:
38341.83
Organism:
Homo sapiens (Human)
Description:
ChEMBL_105457
Residue:
337
  
Inhibitor
Name:
BDBM444434
Synonyms:
US10662159, Example 19
Type:
Small organic molecule
Emp. Form.:
C13H11F6NO3
Mol. Mass.:
343.2218
SMILES:
COc1cccc2CN(Cc12)C(=O)OC(C(F)(F)F)C(F)(F)F
: