Target
Cyclin-dependent kinase 1/G2/mitotic-specific cyclin-B
Ligand
BDBM7290
Substrate
Histone H1
Meas. Tech.
Kinase Inhibition Assay
Temperature
303.15±n/a K
IC50
300±n/a nM
Comments
extracted
Citation
 Leost, MSchultz, CLink, AWu, YZBiernat, JMandelkow, EMBibb, JASnyder, GLGreengard, PZaharevitz, DWGussio, RSenderowicz, AMSausville, EAKunick, CMeijer, L Paullones are potent inhibitors of glycogen synthase kinase-3beta and cyclin-dependent kinase 5/p25. Eur J Biochem 267:5983-94 (2000)  
Target
Name:
Cyclin-dependent kinase 1/G2/mitotic-specific cyclin-B
Synonyms:
CDK1/Cyclin B p34cdc2/Cyclin B
Type:
Protein Complex
Mol. Mass.:
Description:
p34cdc2/cyclin B was purified from M-phase starfish oocytes by affinity chromatography.
Components:
This complex has 2 components.
Component 1
Name:
Cyclin-dependent kinase 1
Synonyms:
CDK1_ORYLA P34 protein kinase cdk1
Type:
Enzyme Subunit
Mol. Mass.:
34693.35
Organism:
Marthasterias glacialis (starfish)
Description:
Q9DGD3 {empty hard to find)
Residue:
303
  
Component 2
Name:
G2/mitotic-specific cyclin-B
Synonyms:
CCNB_MARGL G2/mitotic-specific cyclin-B1
Type:
Enzyme Subunit
Mol. Mass.:
43790.28
Organism:
Marthasterias glacialis (starfish)
Description:
Residue:
388
  
Inhibitor
Name:
BDBM7290
Synonyms:
2,9-dibromopaullone CHEMBL98360 Paullone Analog 29
Type:
Small organic molecule
Emp. Form.:
C16H10Br2N2O
Mol. Mass.:
406.071
SMILES:
Brc1ccc2NC(=O)Cc3c([nH]c4ccc(Br)cc34)-c2c1
:
Substrate
Name:
Histone H1
Synonyms:
Type:
Other Protein Type
Mol. Mass.:
358.43
Organism:
Bos taurus (bovine)
Description:
Residue:
3
NA