Target
Replicase polyprotein 1ab
Ligand
BDBM448318
Substrate
Meas. Tech.
The enzymatic inhibition assay
IC50
20±0.70 nM
Citation
 Qiao, JLi, YSZeng, RLiu, FLLuo, RHHuang, CWang, YFZhang, JQuan, BShen, CMao, XLiu, XSun, WYang, WNi, XWang, KXu, LDuan, ZLZou, QCZhang, HLQu, WLong, YHLi, MHYang, RCLiu, XYou, JZhou, YYao, RLi, WPLiu, JMChen, PLiu, YLin, GFYang, XZou, JLi, LHu, YLu, GWLi, WMWei, YQZheng, YTLei, JYang, S SARS-CoV-2 Mpro inhibitors with antiviral activity in a transgenic mouse model Science 0:0 (2021)  
Target
Name:
Replicase polyprotein 1ab
Synonyms:
ORF1ab polyprotein pp1ab | rep
Type:
Protein
Mol. Mass.:
794070.71
Organism:
2019-nCoV
Description:
P0DTD1
Residue:
7096
  
Inhibitor
Name:
BDBM448318
Synonyms:
MI-32
Type:
Small organic molecule
Emp. Form.:
C24H30ClN3O5
Mol. Mass.:
475.965
SMILES:
Cc1cc(Cl)ccc1OCC(=O)N1C[C@@H]2CCC[C@H]2[C@@H]1C(=O)N[C@@H](C[C@@H]1CCNC1=O)C=O
: