Target
Replicase polyprotein 1ab
Ligand
BDBM50184410
Substrate
Meas. Tech.
Inhibition of proteolytic activity
IC50
175000±n/a nM
Citation
 Zhang, CHStone, EADeshmukh, MIppolito, JAGhahremanpour, MMTirado-Rives, JSpasov, KAZhang, STakeo, YKudalkar, SNLiang, ZIsaacs, FLindenbach, BMiller, SJAnderson, KSJorgensen, WL Potent Noncovalent Inhibitors of the Main Protease of SARS-CoV-2 from Molecular Sculpting of the Drug Perampanel Guided by Free Energy Perturbation Calculations ACS Cent Sci 0:0 (2021)    Article 
Target
Name:
Replicase polyprotein 1ab
Synonyms:
ORF1ab polyprotein pp1ab | rep
Type:
Protein
Mol. Mass.:
794070.71
Organism:
2019-nCoV
Description:
P0DTD1
Residue:
7096
  
Inhibitor
Name:
BDBM50184410
Synonyms:
CHEBI:71013 E2007 Fycompa Perampanel | Perampanel, 1
Type:
Small organic molecule
Emp. Form.:
C23H15N3O
Mol. Mass.:
349.3847
SMILES:
O=c1c(cc(cn1-c1ccccc1)-c1ccccn1)-c1ccccc1C#N
: