Target
Replicase polyprotein 1ab
Ligand
BDBM448369
Substrate
Meas. Tech.
Inhibition of proteolytic activity
IC50
18±2.00 nM
Citation
 Zhang, CHStone, EADeshmukh, MIppolito, JAGhahremanpour, MMTirado-Rives, JSpasov, KAZhang, STakeo, YKudalkar, SNLiang, ZIsaacs, FLindenbach, BMiller, SJAnderson, KSJorgensen, WL Potent Noncovalent Inhibitors of the Main Protease of SARS-CoV-2 from Molecular Sculpting of the Drug Perampanel Guided by Free Energy Perturbation Calculations ACS Cent Sci 0:0 (2021)    Article 
Target
Name:
Replicase polyprotein 1ab
Synonyms:
ORF1ab polyprotein pp1ab | rep
Type:
Protein
Mol. Mass.:
794070.71
Organism:
2019-nCoV
Description:
P0DTD1
Residue:
7096
  
Inhibitor
Name:
BDBM448369
Synonyms:
Perampanel, 21
Type:
Small organic molecule
Emp. Form.:
C27H18Cl2N4O5
Mol. Mass.:
549.362
SMILES:
Clc1cc(OCc2ccccc2Cl)cc(c1)C1C=C(C(=O)N(C1=O)c1cccnc1)c1c[nH]c(=O)[nH]c1=O
: