Target
Replicase polyprotein 1ab
Ligand
BDBM448373
Substrate
Meas. Tech.
Inhibition of proteolytic activity
IC50
25±3.00 nM
Citation
 Zhang, CHStone, EADeshmukh, MIppolito, JAGhahremanpour, MMTirado-Rives, JSpasov, KAZhang, STakeo, YKudalkar, SNLiang, ZIsaacs, FLindenbach, BMiller, SJAnderson, KSJorgensen, WL Potent Noncovalent Inhibitors of the Main Protease of SARS-CoV-2 from Molecular Sculpting of the Drug Perampanel Guided by Free Energy Perturbation Calculations ACS Cent Sci 0:0 (2021)    Article 
Target
Name:
Replicase polyprotein 1ab
Synonyms:
ORF1ab polyprotein pp1ab | rep
Type:
Protein
Mol. Mass.:
794070.71
Organism:
2019-nCoV
Description:
P0DTD1
Residue:
7096
  
Inhibitor
Name:
BDBM448373
Synonyms:
Perampanel, 25
Type:
Small organic molecule
Emp. Form.:
C22H14ClF3N4O5
Mol. Mass.:
506.819
SMILES:
FC(F)(F)COc1cc(Cl)cc(c1)C1C=C(C(=O)N(C1=O)c1cccnc1)c1c[nH]c(=O)[nH]c1=O
: