Target
SRSF protein kinase 1
Ligand
BDBM448674
Substrate
Meas. Tech.
Inhibition Assay
IC50
8.20±n/a nM
Citation
 Bates, DMorris, JToop, HBatson, JMorley, AD Compounds US Patent  US10696661 Publication Date 6/30/2020 
Target
Name:
SRSF protein kinase 1
Synonyms:
SRPK1 SRSF protein kinase 1 (SRPK1) Serine/threonine-protein kinase SRPK1
Type:
Protein
Mol. Mass.:
74318.38
Organism:
Homo sapiens (Human)
Description:
Q96SB4
Residue:
655
  
Inhibitor
Name:
BDBM448674
Synonyms:
N-(5-chloro-2-(4-(oxazol-4-ylmethyl)piperazin-1-yl)phenyl)-5- (pyridin-4-yl)furan-2-carboxamide | US10696661, Compound 27
Type:
Small organic molecule
Emp. Form.:
C24H22ClN5O3
Mol. Mass.:
463.916
SMILES:
Clc1ccc(N2CCN(Cc3cocn3)CC2)c(NC(=O)c2ccc(o2)-c2ccncc2)c1
: