Target
SRSF protein kinase 1
Ligand
BDBM448695
Substrate
Meas. Tech.
Inhibition Assay
IC50
0.700±n/a nM
Citation
 Bates, DMorris, JToop, HBatson, JMorley, AD Compounds US Patent  US10696661 Publication Date 6/30/2020 
Target
Name:
SRSF protein kinase 1
Synonyms:
SRPK1 SRSF protein kinase 1 (SRPK1) Serine/threonine-protein kinase SRPK1
Type:
Protein
Mol. Mass.:
74318.38
Organism:
Homo sapiens (Human)
Description:
Q96SB4
Residue:
655
  
Inhibitor
Name:
BDBM448695
Synonyms:
N-(2-(4-(furan-3-ylmethyl)piperazin-1-yl)-5- (trifluoromethyl)phenyl)-5-(tetrahydro-2H-pyran-4-yl)furan- 2-carboxamide | US10696661, Compound 43
Type:
Small organic molecule
Emp. Form.:
C26H28F3N3O4
Mol. Mass.:
503.5134
SMILES:
FC(F)(F)c1ccc(N2CCN(Cc3ccoc3)CC2)c(NC(=O)c2ccc(o2)C2CCOCC2)c1
: