Target
SRSF protein kinase 1
Ligand
BDBM448727
Substrate
Meas. Tech.
Inhibition Assay
IC50
0.500±n/a nM
Citation
 Bates, DMorris, JToop, HBatson, JMorley, AD Compounds US Patent  US10696661 Publication Date 6/30/2020 
Target
Name:
SRSF protein kinase 1
Synonyms:
SRPK1 SRSF protein kinase 1 (SRPK1) Serine/threonine-protein kinase SRPK1
Type:
Protein
Mol. Mass.:
74318.38
Organism:
Homo sapiens (Human)
Description:
Q96SB4
Residue:
655
  
Inhibitor
Name:
BDBM448727
Synonyms:
5-(tetrahydro-2H-pyran-4-yl)-N-(2-(4-(thiazol-5- ylmethyl)piperazin-1-yl)-5-(trifluoromethyl)phenyl)furan-2- carboxamide | US10696661, Compound 70
Type:
Small organic molecule
Emp. Form.:
C25H27F3N4O3S
Mol. Mass.:
520.567
SMILES:
FC(F)(F)c1ccc(N2CCN(Cc3cncs3)CC2)c(NC(=O)c2ccc(o2)C2CCOCC2)c1
: