Target
Serine/threonine-protein kinase B-raf [V600E]
Ligand
BDBM87753
Substrate
Meas. Tech.
In Vitro Activity Assay
IC50
200±n/a nM
Citation
 Aversa, RJBarsanti, PABurger, MTDillon, MPDipesa, AHu, CLou, YNishiguchi, GAPan, YPolyakov, VRRamurthy, SRico, ACSetti, LQSmith, ASubramanian, STaft, BRTanner, HRWan, LYusuff, N Biaryl amide compounds as kinase inhibitors US Patent  US10709712 Publication Date 7/14/2020 
Target
Name:
Serine/threonine-protein kinase B-raf [V600E]
Synonyms:
B-RAF V600E B-Raf Protein Kinase Mutant (V600E) BRAF BRAF mutant V600E BRAF_HUMAN Protein mono-ADP-ribosyltransferase (PARP3) RAFB1 Serine/threonine-protein kinase B-raf (V600E) V-RAF murine sarcoma viral oncogene homologue B1 mutant (BRAF V600E)
Type:
Mol. Mass.:
84474.98
Organism:
Homo sapiens (Human)
Description:
P15056 V600E
Residue:
766
  
Inhibitor
Name:
BDBM87753
Synonyms:
US10245267, Example 788 US9694016, 788
Type:
Small organic molecule
Emp. Form.:
C25H26F3N5O3
Mol. Mass.:
501.5008
SMILES:
Cc1ncc(NC(=O)c2cccc(c2)C(F)(F)F)cc1-c1cc(nc(n1)C(C)(C)O)N1CCOCC1
: