Target
RAF proto-oncogene serine/threonine-protein kinase
Ligand
BDBM87892
Substrate
Meas. Tech.
In Vitro Activity Assay
IC50
1.82±n/a nM
Citation
 Aversa, RJBarsanti, PABurger, MTDillon, MPDipesa, AHu, CLou, YNishiguchi, GAPan, YPolyakov, VRRamurthy, SRico, ACSetti, LQSmith, ASubramanian, STaft, BRTanner, HRWan, LYusuff, N Biaryl amide compounds as kinase inhibitors US Patent  US10709712 Publication Date 7/14/2020 
Target
Name:
RAF proto-oncogene serine/threonine-protein kinase
Synonyms:
C-Raf Protein Kinase RAF RAF1 Raf-1 Serine/threonine-protein kinase C-Raf | cRaf
Type:
Serine/threonine-protein kinase
Mol. Mass.:
73082.52
Organism:
Homo sapiens (Human)
Description:
P04049
Residue:
648
  
Inhibitor
Name:
BDBM87892
Synonyms:
US10245267, Example 921 US9694016, 921
Type:
Small organic molecule
Emp. Form.:
C22H21F3N6O4S
Mol. Mass.:
522.5
SMILES:
Cc1ncc(NC(=O)c2ccnc(c2)C(F)(F)F)cc1-c1cc(N2CCOCC2)c(nn1)S(C)(=O)=O
: