Target
RAF proto-oncogene serine/threonine-protein kinase
Ligand
BDBM87917
Substrate
Meas. Tech.
In Vitro Activity Assay
IC50
0.960±n/a nM
Citation
 Aversa, RJBarsanti, PABurger, MTDillon, MPDipesa, AHu, CLou, YNishiguchi, GAPan, YPolyakov, VRRamurthy, SRico, ACSetti, LQSmith, ASubramanian, STaft, BRTanner, HRWan, LYusuff, N Biaryl amide compounds as kinase inhibitors US Patent  US10709712 Publication Date 7/14/2020 
Target
Name:
RAF proto-oncogene serine/threonine-protein kinase
Synonyms:
C-Raf Protein Kinase RAF RAF1 Raf-1 Serine/threonine-protein kinase C-Raf | cRaf
Type:
Serine/threonine-protein kinase
Mol. Mass.:
73082.52
Organism:
Homo sapiens (Human)
Description:
P04049
Residue:
648
  
Inhibitor
Name:
BDBM87917
Synonyms:
US10245267, Example 946 US9694016, 946
Type:
Small organic molecule
Emp. Form.:
C28H33FN4O3
Mol. Mass.:
492.585
SMILES:
CC(C)Oc1ncc(cc1N1CCOCC1)-c1cc(NC(=O)c2ccnc(c2)C(C)(C)F)ccc1C
: