Target
Bone morphogenetic protein receptor type-1A [198-525]
Ligand
BDBM451803
Substrate
Meas. Tech.
ADPGlo Assay
IC50
903±n/a nM
Citation
 Arista, LBabu, SBian, JCui, KDillon, MPLattmann, RLi, JLiao, LLizos, DRamos, RStiefl, NJUllrich, TUsselmann, PWang, XWaykole, LMWeiler, SZhang, YZhou, YZhu, T Aminopyridine derivatives and their use as selective ALK-2 inhibitors US Patent  US10710980 Publication Date 7/14/2020 
Target
Name:
Bone morphogenetic protein receptor type-1A [198-525]
Synonyms:
ACVRLK3 Activin receptor-like kinase 3 (ALK3) (aa 198-525) BMPR1A | BMR1A_HUMAN
Type:
Enzyme Catalytic Domain
Mol. Mass.:
37140.17
Organism:
Homo sapiens (Human)
Description:
aa 198-525
Residue:
328
  
Inhibitor
Name:
BDBM451803
Synonyms:
US10710980, Example 35 | US10947218, Example 35
Type:
Small organic molecule
Emp. Form.:
C31H38F2N4O2
Mol. Mass.:
536.6558
SMILES:
Nc1ncc(cc1C(=O)NC12CCC(O)(CC1)CC2)-c1ccc(cc1)[C@]12C[C@H]1CN(C2)C1CCC(F)(F)CC1
: