Target
Glycogen synthase kinase-3 beta
Ligand
BDBM7325
Substrate
GSK-3 Peptide Substrate
Meas. Tech.
Kinase Inhibition Assay
Temperature
303.15±n/a K
IC50
90±n/a nM
Comments
extracted
Citation
 Kunick, CLauenroth, KWieking, KXie, XSchultz, CGussio, RZaharevitz, DLeost, MMeijer, LWeber, AJorgensen, FSLemcke, T Evaluation and comparison of 3D-QSAR CoMSIA models for CDK1, CDK5, and GSK-3 inhibition by paullones. J Med Chem 47:22-36 (2004)  
Target
Name:
Glycogen synthase kinase-3 beta
Synonyms:
GSK-3, beta Glycogen Synthase Kinase-3, beta | Gsk3b
Type:
Enzyme
Mol. Mass.:
46754.43
Organism:
Rattus norvegicus (rat)
Description:
The rat GSK-3 beta cDNA was inserted into the baculovirus vector. The protein was purified from virus-infected sf9 insect cells
Residue:
420
  
Inhibitor
Name:
BDBM7325
Synonyms:
2-(2-oxopropyl)-9-(trifluoromethyl)-7,12-dihydroindolo[3,2-d][1]benzazepin-6(5H)-one NSC 718539 | Paullone Analogue 60
Type:
Small organic molecule
Emp. Form.:
C20H15F3N2O2
Mol. Mass.:
372.3405
SMILES:
CC(=O)Cc1ccc2NC(=O)Cc3c([nH]c4ccc(cc34)C(F)(F)F)-c2c1
:
Substrate
Name:
GSK-3 Peptide Substrate
Synonyms:
GS-1 Peptide | Phospho-GS2 Substrate Peptide
Type:
Peptide
Mol. Mass.:
3045.17
Organism:
Description:
Residue:
27