Target
Toll-like receptor 8
Ligand
BDBM427674
Substrate
Meas. Tech.
TLR7/8/9 Inhibition Reporter Assays
IC50
0.280±n/a nM
Citation
 Dyckman, AJDodd, DSMussari, CPSherwood, TCWhiteley, BKGilmore, JLKumar, SRPasunoori, LSrinivas, PVDuraisamy, SKHegde, SAnumula, RK 4-Azaindole compounds US Patent  US10730877 Publication Date 8/4/2020 
Target
Name:
Toll-like receptor 8
Synonyms:
CD_antigen: CD288 TLR8_HUMAN | TRL8
Type:
Enzyme
Mol. Mass.:
119828.77
Organism:
Homo sapiens (Human)
Description:
Q9NR97
Residue:
1041
  
Inhibitor
Name:
BDBM427674
Synonyms:
US10544143, Example 106 US11053244, Example 106
Type:
Small organic molecule
Emp. Form.:
C25H33N7O2
Mol. Mass.:
463.5752
SMILES:
COc1cc(cn2ncnc12)-c1[nH]c2ccc(nc2c1C(C)C)N1CCN(CC(C)(C)O)CC1
: