Target
Toll-like receptor 7
Ligand
BDBM428372
Substrate
Meas. Tech.
TLR7/8/9 Inhibition Reporter Assays
IC50
0.190±n/a nM
Citation
 Dyckman, AJDodd, DSMussari, CPSherwood, TCWhiteley, BKGilmore, JLKumar, SRPasunoori, LSrinivas, PVDuraisamy, SKHegde, SAnumula, RK 4-Azaindole compounds US Patent  US10730877 Publication Date 8/4/2020 
Target
Name:
Toll-like receptor 7
Synonyms:
ORF Names:UNQ248/PRO285 TLR7_HUMAN | Toll-like receptor 7 (TLR7)
Type:
Enzyme
Mol. Mass.:
120945.35
Organism:
Homo sapiens (Human)
Description:
Q9NYK1
Residue:
1049
  
Inhibitor
Name:
BDBM428372
Synonyms:
US10544143, Example 808 US10730877, Example 838 | US11053244, Example 838
Type:
Small organic molecule
Emp. Form.:
C27H36N8O
Mol. Mass.:
488.6277
SMILES:
CC(C)c1c([nH]c2ccc(nc12)N1CCN(C[C@H]1C)C(=O)CN(C)C)-c1cn2ncnc2c(C)c1C
: