Target
Polyunsaturated fatty acid lipoxygenase ALOX12
Ligand
BDBM50447181
Substrate
Meas. Tech.
UV-vis cuvette-based assay
IC50
160±n/a nM
Citation
 Maloney, DJLuci, DKJadhav, AHolman, TNadler, JLHolinstat, MTaylor-Fishwick, DSimeonov, AYasgar, AMcKenzie, S 4-((2-hydroxy-3-methoxybenzyl)amino)benzenesulfonamide derivatives as potent and selective inhibitors of 12-lipoxygenase US Patent  US10752581 Publication Date 8/25/2020 
Target
Name:
Polyunsaturated fatty acid lipoxygenase ALOX12
Synonyms:
12-LOX 12LO Arachidonate 12-lipoxygenase LOG12 Platelet 12-lipoxygenase | Platelet-type lipoxygenase 12
Type:
Protein
Mol. Mass.:
75689.18
Organism:
Homo sapiens (Human)
Description:
P18054
Residue:
663
  
Inhibitor
Name:
BDBM50447181
Synonyms:
CHEMBL3113197 | US10752581, Compound 67
Type:
Small organic molecule
Emp. Form.:
C23H26N2O4S
Mol. Mass.:
426.529
SMILES:
COc1cccc(CNc2ccc(cc2)S(=O)(=O)Nc2cccc(c2)C(C)C)c1O
: