Target
Acetyl-CoA carboxylase 2
Ligand
BDBM459213
Substrate
Meas. Tech.
Kinase Assay
IC50
4.80±n/a nM
Citation
 Tang, WYang, XGu, ZLi, CZhang, ZWan, ZWang, XZhang, Y Thienopyrimidine derivative and use thereof in medicine US Patent  US10759812 Publication Date 9/1/2020 
Target
Name:
Acetyl-CoA carboxylase 2
Synonyms:
ACACB ACC-beta ACCB Acetyl-CoA carboxylase 2 Acetyl-CoA carboxylase 2 (ACC2)
Type:
Protein
Mol. Mass.:
276535.21
Organism:
Homo sapiens (Human)
Description:
O00763
Residue:
2458
  
Inhibitor
Name:
BDBM459213
Synonyms:
2-[1-[2-[[(3aS,6aR)-5-(cyanomethyl)-5-hydroxy-2,3,3a,4,6,6a-hexahydro-1H-pentalen-2-yl]oxy]-2-(2-methoxyphenyl)ethyl]-5-methyl-6-oxazol-2-yl-2,4-dioxo-thieno[2,3-d]pyrimid-3-yl]-2-methyl-propanoic acid | US10759812, Example 27
Type:
Small organic molecule
Emp. Form.:
C33H36N4O8S
Mol. Mass.:
648.726
SMILES:
COc1ccccc1C(Cn1c2sc(c(C)c2c(=O)n(c1=O)C(C)(C)C(O)=O)-c1ncco1)O[C@H]1C[C@H]2CC(O)(CC#N)C[C@H]2C1
: