Target
Acetyl-CoA carboxylase 1
Ligand
BDBM459214
Substrate
Meas. Tech.
Kinase Assay
IC50
0.470±n/a nM
Citation
 Tang, WYang, XGu, ZLi, CZhang, ZWan, ZWang, XZhang, Y Thienopyrimidine derivative and use thereof in medicine US Patent  US10759812 Publication Date 9/1/2020 
Target
Name:
Acetyl-CoA carboxylase 1
Synonyms:
ACAC ACACA_HUMAN ACC1 Acetyl-CoA carboxylase 1 | Acetyl-CoA carboxylase 1 (ACC1)
Type:
Protein
Mol. Mass.:
265543.22
Organism:
Homo sapiens (Human)
Description:
Q13085
Residue:
2346
  
Inhibitor
Name:
BDBM459214
Synonyms:
2-[1-[2-[[(3aR,6aS)-5-methylsulfonyl-1,2,3,3a,4,5,6,6a-octahydropentalen-2-yl]oxy]-2-(2-methoxyphenyl)ethyl]-5-methyl-6-oxazol-2-yl-2,4-dioxo-thieno[2,3-d]pyrimid-3-yl]-2-methyl-propanoic acid | US10759812, Example 29
Type:
Small organic molecule
Emp. Form.:
C32H37N3O9S2
Mol. Mass.:
671.781
SMILES:
COc1ccccc1C(Cn1c2sc(c(C)c2c(=O)n(c1=O)C(C)(C)C(O)=O)-c1ncco1)O[C@H]1C[C@H]2C[C@@H](C[C@H]2C1)S(C)(=O)=O
: