Target
Monoglyceride lipase
Ligand
BDBM280565
Substrate
Meas. Tech.
In Vitro Competitive Activity-Based Protein Profiling Assay
IC50
<100±n/a nM
Citation
 Buzard, DJShaghafi, MBCisar, JSGrice, CAJones, TKWeber, OD Spirocycle compounds and methods of making and using same US Patent  US10781211 Publication Date 9/22/2020 
Target
Name:
Monoglyceride lipase
Synonyms:
MAG lipase Mgll Monoglyceride Lipase (MGL)
Type:
Hydrolase
Mol. Mass.:
33391.67
Organism:
Mus musculus (mouse)
Description:
Assays were using membranes of recombinant MAG Lipase transiently transfected in COS-7 cells.
Residue:
303
  
Inhibitor
Name:
BDBM280565
Synonyms:
US10030020, Example 110 | US10781211, Example 110
Type:
Small organic molecule
Emp. Form.:
C24H29ClF7N3O2
Mol. Mass.:
559.948
SMILES:
FC1CCN(CC1)c1cccc(CN2CCCC22CCN(CC2)C(=O)OC(C(F)(F)F)C(F)(F)F)c1Cl
: