Target
Glycogen synthase kinase-3 beta
Ligand
BDBM7491
Substrate
GSK-3 Peptide Substrate
Meas. Tech.
Kinase Inhibition Assay
pH
7.5±n/a
Temperature
303.15±n/a K
IC50
10±n/a nM
Citation
 Kunick, CLauenroth, KLeost, MMeijer, LLemcke, T 1-Azakenpaullone is a selective inhibitor of glycogen synthase kinase-3 beta. Bioorg Med Chem Lett 14:413-6 (2004)  
Target
Name:
Glycogen synthase kinase-3 beta
Synonyms:
GSK-3, beta Glycogen Synthase Kinase-3, beta | Gsk3b
Type:
Enzyme
Mol. Mass.:
46754.43
Organism:
Rattus norvegicus (rat)
Description:
The rat GSK-3 beta cDNA was inserted into the baculovirus vector. The protein was purified from virus-infected sf9 insect cells
Residue:
420
  
Inhibitor
Name:
BDBM7491
Synonyms:
(4Z)-4-(2-amino-5-oxo-3,5-dihydro-4H-imidazol-4-ylidene)-2-bromo-4,5,6,7-tetrahydropyrrolo[2,3-c]azepin-8(1H)-one (Z)-hymenialdisine 4-(2-Amino-4-oxo-2-imidazolidin-5-ylidene)-2-bromo-4,5,6,7-tetrahydropyrrolo[2,3-c]azepin-8-one 4-(2-amino-4-oxo-1H-imidazol-5(4H)-ylidene)-2-bromo-4,5,6,7-tetrahydropyrrolo[2,3-c]azepin-8(1H)-one 4-[2-Amino-5-oxo-3,5-dihydro-imidazol-(4Z)-ylidene]-2-bromo-4,5,6,7-tetrahydro-1H-pyrrolo[2,3-c]azepin-8-one Hymenialdisine | Hymenialdisine, 1
Type:
Small organic molecule
Emp. Form.:
C11H10BrN5O2
Mol. Mass.:
324.133
SMILES:
NC1=NC(=O)C(N1)=C1CCNC(=O)c2[nH]c(Br)cc12
:
Substrate
Name:
GSK-3 Peptide Substrate
Synonyms:
GS-1 Peptide | Phospho-GS2 Substrate Peptide
Type:
Peptide
Mol. Mass.:
3045.17
Organism:
Description:
Residue:
27