Target
Polyphenol oxidase 1
Ligand
BDBM32020
Substrate
Meas. Tech.
Tyrosinase Inhibition Assay
IC50
700000±n/a nM
Citation
 Jia, QZhao, J Diarylalkanes as potent inhibitors of binuclear enzymes US Patent  US10857082 Publication Date 12/8/2020 
Target
Name:
Polyphenol oxidase 1
Synonyms:
PPO1 Polyphenol oxidase | Tyrosinase
Type:
Enzyme
Mol. Mass.:
63902.83
Organism:
Agaricus bisporus (White button mushroom)
Description:
Q00024
Residue:
568
  
Inhibitor
Name:
BDBM32020
Synonyms:
4-[4-(3,4-dihydroxyphenyl)-2,3-dimethyl-butyl]pyrocatechol 4-[4-[3,4-bis(oxidanyl)phenyl]-2,3-dimethyl-butyl]benzene-1,2-diol CHEMBL52 MLS000069451 Nordihydroguaiaretic acid (NDGA) US10857082, Compound 2.18 | cid_4534
Type:
Small organic molecule
Emp. Form.:
C18H22O4
Mol. Mass.:
302.3649
SMILES:
CC(Cc1ccc(O)c(O)c1)C(C)Cc1ccc(O)c(O)c1
: