Target
Protein Wnt-3a
Ligand
BDBM300479
Substrate
Meas. Tech.
HCT116 TOPFlash Assay
IC50
46.6±n/a nM
Citation
 Thede, KScott, WBender, EGolz, SHägebarth, ALienau, PPuehler, FBasting, DSchneider, DMöwes, MRichter, AZorn, LLiu, NMönning, USiegel, F Compounds US Patent  US10130633 Publication Date 11/20/2018 
Target
Name:
Protein Wnt-3a
Synonyms:
WNT3A | WNT3A_HUMAN
Type:
PROTEIN
Mol. Mass.:
39379.02
Organism:
Homo sapiens (Human)
Description:
ChEMBL_1469237
Residue:
352
  
Inhibitor
Name:
BDBM300479
Synonyms:
3-({[1-(4-methylpiperazin-1-yl)cyclopropyl]carbonyl}amino)-4-[(methylsulfonyl)methyl]-N-(5-phenyl-1,3,4-thiadiazol-2-yl)benzamide | US10130633, Example 49
Type:
Small organic molecule
Emp. Form.:
C26H30N6O4S2
Mol. Mass.:
554.684
SMILES:
CN1CCN(CC1)C1(CC1)C(=O)Nc1cc(ccc1CS(C)(=O)=O)C(=O)Nc1nnc(s1)-c1ccccc1
: