Target
Protein Wnt-3a
Ligand
BDBM300483
Substrate
Meas. Tech.
HEK TOP OncoFlash Assay
IC50
820±n/a nM
Citation
 Thede, KScott, WBender, EGolz, SHägebarth, ALienau, PPuehler, FBasting, DSchneider, DMöwes, MRichter, AZorn, LLiu, NMönning, USiegel, F Compounds US Patent  US10130633 Publication Date 11/20/2018 
Target
Name:
Protein Wnt-3a
Synonyms:
WNT3A | WNT3A_HUMAN
Type:
PROTEIN
Mol. Mass.:
39379.02
Organism:
Homo sapiens (Human)
Description:
ChEMBL_1469237
Residue:
352
  
Inhibitor
Name:
BDBM300483
Synonyms:
3-{[(4-cyclopropylpiperazin-1-yl)acetyl]amino}-N-(5-phenyl-1,3,4-thiadiazol-2-yl)-4-(trifluoromethoxy)benzamide | US10130633, Example 53
Type:
Small organic molecule
Emp. Form.:
C25H25F3N6O3S
Mol. Mass.:
546.565
SMILES:
FC(F)(F)Oc1ccc(cc1NC(=O)CN1CCN(CC1)C1CC1)C(=O)Nc1nnc(s1)-c1ccccc1
: