Target
Protein Wnt-3a
Ligand
BDBM300564
Substrate
Meas. Tech.
HEK TOP OncoFlash Assay
IC50
31.0±n/a nM
Citation
 Thede, KScott, WBender, EGolz, SHägebarth, ALienau, PPuehler, FBasting, DSchneider, DMöwes, MRichter, AZorn, LLiu, NMönning, USiegel, F Compounds US Patent  US10130633 Publication Date 11/20/2018 
Target
Name:
Protein Wnt-3a
Synonyms:
WNT3A | WNT3A_HUMAN
Type:
PROTEIN
Mol. Mass.:
39379.02
Organism:
Homo sapiens (Human)
Description:
ChEMBL_1469237
Residue:
352
  
Inhibitor
Name:
BDBM300564
Synonyms:
4-(cyclopropyloxy)-N-[6-(2-fluorophenyl)pyridin-3-yl]-3-({[1-(morpholin-4-yl)cyclopropyl]carbonyl}amino)benzamide | US10130633, Example 134
Type:
Small organic molecule
Emp. Form.:
C29H29FN4O4
Mol. Mass.:
516.5634
SMILES:
Fc1ccccc1-c1ccc(NC(=O)c2ccc(OC3CC3)c(NC(=O)C3(CC3)N3CCOCC3)c2)cn1
: