Target
Replicase polyprotein 1ab
Ligand
BDBM476303
Substrate
Meas. Tech.
antiviral activity
EC50
>100000±n/a nM
Citation
 Painter, GRGuthrie, DBBluemling, GRNatchus, MR N4-hydroxycytidine and derivatives and anti-viral uses related thereto US Patent  US10874683 Publication Date 12/29/2020 
Target
Name:
Replicase polyprotein 1ab
Synonyms:
3C-like proteinase 3C-like proteinase (SARS-CoV 3Cpro) 3CLp GFL Guanine-N7 methyltransferase Helicase Leader protein Non-structural protein 10 Non-structural protein 3 Non-structural protein 6 Non-structural protein 8 ORF1ab polyprotein PL2-PRO Pol R1AB_SARS RdRp SARS coronavirus main proteinase nsp1 nsp12 nsp14 nsp16 nsp3 nsp5 nsp7 nsp9 pp1ab | rep
Type:
Protein
Mol. Mass.:
790250.81
Organism:
Human SARS coronavirus (SARS-CoV) (Severe acute respiratory syndrome coronavirus)
Description:
P0C6X7
Residue:
7073
  
Inhibitor
Name:
BDBM476303
Synonyms:
US10874683, Example 56.5 | US10874683, Example EIDD-02053-01
Type:
Small organic molecule
Emp. Form.:
C10H15N3O6
Mol. Mass.:
273.2426
SMILES:
CC1(O)[C@@H](O)[C@@H](CO)O[C@H]1n1ccc(NO)nc1=O
: