Target
Structural polyprotein
Ligand
BDBM476299
Substrate
Meas. Tech.
CPE Assay
EC50
1800±n/a nM
Citation
 Painter, GRGuthrie, DBBluemling, GRNatchus, MR N4-hydroxycytidine and derivatives and anti-viral uses related thereto US Patent  US10874683 Publication Date 12/29/2020 
Target
Name:
Structural polyprotein
Synonyms:
POLS_CHIKS | p130
Type:
Protein
Mol. Mass.:
138165.86
Organism:
CHIKV
Description:
Q8JUX5
Residue:
1248
  
Inhibitor
Name:
BDBM476299
Synonyms:
US10874683, Example 00106 US10874683, Example EIDD-01931-04 US10874683, Example EIDD-02261-01 US10874683, Example EIDD-02416-01
Type:
Small organic molecule
Emp. Form.:
C9H13N3O6
Mol. Mass.:
259.216
SMILES:
OC[C@H]1O[C@H](C(O)[C@H]1O)n1ccc(NO)nc1=O
: