Target
TSC22 domain family protein 3
Ligand
BDBM476579
Substrate
Meas. Tech.
GILZ gene assays
IC50
162±n/a nM
Citation
 Garbaccio, RMKern, JCMulhearn, JJBrandish, PE Phosphonate linkers and their use to facilitate cellular retention of compounds US Patent  US10869929 Publication Date 12/22/2020 
Target
Name:
TSC22 domain family protein 3
Synonyms:
DSIP-immunoreactive peptide Delta sleep-inducing peptide immunoreactor Glucocorticoid-induced leucine zipper protein T22D3_HUMAN TSC-22-related protein TSC22D3 | hDIP
Type:
Protein
Mol. Mass.:
14799.51
Organism:
Human
Description:
Q99576
Residue:
134
  
Inhibitor
Name:
BDBM476579
Synonyms:
US10869929, Compound 12 | US11554172, Compound 12
Type:
Small organic molecule
Emp. Form.:
C26H35F2O8PS
Mol. Mass.:
576.587
SMILES:
CCC(=O)O[C@@]1([C@H](C)C[C@H]2[C@@H]3C[C@H](F)C4=CC(=O)C=C[C@]4(C)[C@@]3(F)[C@@H](O)C[C@]12C)C(=O)SCCP(O)(O)=O
: