Target
D(3) dopamine receptor
Ligand
BDBM476764
Substrate
Meas. Tech.
Binding Assay
Ki
0.026±n/a nM
Citation
 Tobinaga, HMasuda, KInagaki, MYonehara, MMasuda, M Nitrogen-containing condensed ring compounds having dopamine D3 antagonistic effect US Patent  US10870660 Publication Date 12/22/2020 
Target
Name:
D(3) dopamine receptor
Synonyms:
DOPAMINE D3 DRD3_HUMAN Dopamine D3 receptor (D3) Dopamine receptor Dopamine receptor D3
Type:
Mol. Mass.:
44243.43
Organism:
Homo sapiens (Human)
Description:
Residue:
400
  
Inhibitor
Name:
BDBM476764
Synonyms:
US10870660, Compound III-064 | US11345716, Compound III-064
Type:
Small organic molecule
Emp. Form.:
C28H35F3N4O3S
Mol. Mass.:
564.663
SMILES:
CC(Oc1nc2CCN(CC[C@H]3CC[C@@H](CC3)NC(=O)c3cccc4C(=O)N(C)Cc34)CCc2s1)C(F)(F)F
: