Target
Replicase polyprotein 1ab
Ligand
BDBM476932
Substrate
Meas. Tech.
Enzyme Assays and Inhibition Studies
IC50
280±80 nM
Citation
 Dampalla, CSKim, YBickmeier, NRathnayake, ADNguyen, HNZheng, JKashipathy, MMBaird, MABattaile, KPLovell, SPerlman, SChang, KOGroutas, WC Structure-Guided Design of Conformationally Constrained Cyclohexane Inhibitors of Severe Acute Respiratory Syndrome Coronavirus-2 3CL Protease. J Med Chem 64:10047-10058 (2021)  
Target
Name:
Replicase polyprotein 1ab
Synonyms:
ORF1ab polyprotein pp1ab | rep
Type:
Protein
Mol. Mass.:
794070.71
Organism:
2019-nCoV
Description:
P0DTD1
Residue:
7096
  
Inhibitor
Name:
BDBM476932
Synonyms:
SARS-CoV-2 3CLpro Inhibitors 2c | SARS-CoV-2 3CLpro Inhibitors 2d
Type:
Small organic molecule
Emp. Form.:
C24H37N3O5
Mol. Mass.:
447.5677
SMILES:
CC(C)C[C@H](NC(=O)OCC1CC2CC=CC(C1)C2)C(=O)NC(CC1CCNC1=O)C=O
: