Target
Replicase polyprotein 1ab
Ligand
BDBM476928
Substrate
Meas. Tech.
Cell-Based Assay for Antiviral Activity
EC50
35±1.00 nM
Citation
 Dampalla, CSKim, YBickmeier, NRathnayake, ADNguyen, HNZheng, JKashipathy, MMBaird, MABattaile, KPLovell, SPerlman, SChang, KOGroutas, WC Structure-Guided Design of Conformationally Constrained Cyclohexane Inhibitors of Severe Acute Respiratory Syndrome Coronavirus-2 3CL Protease. J Med Chem 64:10047-10058 (2021)  
Target
Name:
Replicase polyprotein 1ab
Synonyms:
ORF1ab polyprotein pp1ab | rep
Type:
Protein
Mol. Mass.:
794070.71
Organism:
2019-nCoV
Description:
P0DTD1
Residue:
7096
  
Inhibitor
Name:
BDBM476928
Synonyms:
SARS-CoV-2 3CLpro Inhibitors 2a | SARS-CoV-2 3CLpro Inhibitors 2b
Type:
Small organic molecule
Emp. Form.:
C24H39N3O5
Mol. Mass.:
449.5836
SMILES:
CC(C)C[C@H](NC(=O)OCC1CC2CCCC(C1)C2)C(=O)NC(CC1CCNC1=O)C=O
: