Target
Replicase polyprotein 1ab
Ligand
BDBM476965
Substrate
Meas. Tech.
SARS-CoV-2 Protease FRET Assay
IC50
86±0.10 nM
Citation
 Bai, BBelovodskiy, AHena, MKandadai, ASJoyce, MASaffran, HAShields, JAKhan, MBArutyunova, ELu, JBajwa, SKHockman, DFischer, CLamer, TVuong, Wvan Belkum, MJGu, ZLin, FDu, YXu, JRahim, MYoung, HSVederas, JCTyrrell, DLLemieux, MJNieman, JA Peptidomimetic ?-Acyloxymethylketone Warheads with Six-Membered Lactam P1 Glutamine Mimic: SARS-CoV-2 3CL Protease Inhibition, Coronavirus Antiviral Activity, and  J Med Chem 0:0 (2021)  
Target
Name:
Replicase polyprotein 1ab
Synonyms:
ORF1ab polyprotein pp1ab | rep
Type:
Protein
Mol. Mass.:
794070.71
Organism:
2019-nCoV
Description:
P0DTD1
Residue:
7096
  
Inhibitor
Name:
BDBM476965
Synonyms:
SARS-CoV-2 3CLP and CoV inhibitor 15e
Type:
Small organic molecule
Emp. Form.:
C33H43F3N4O7
Mol. Mass.:
664.7123
SMILES:
COc1cccc2[nH]c(cc12)C(=O)N[C@@H](CC(C)C)C(=O)N[C@@H](C[C@@H]1CCCNC1=O)C(=O)COC(=O)C1(CCCCC1)C(F)(F)F
: