Target
Cathepsin B
Ligand
BDBM476972
Substrate
Meas. Tech.
SARS-CoV-2 Protease FRET Assay
IC50
201±5.00 nM
Citation
 Bai, BBelovodskiy, AHena, MKandadai, ASJoyce, MASaffran, HAShields, JAKhan, MBArutyunova, ELu, JBajwa, SKHockman, DFischer, CLamer, TVuong, Wvan Belkum, MJGu, ZLin, FDu, YXu, JRahim, MYoung, HSVederas, JCTyrrell, DLLemieux, MJNieman, JA Peptidomimetic ?-Acyloxymethylketone Warheads with Six-Membered Lactam P1 Glutamine Mimic: SARS-CoV-2 3CL Protease Inhibition, Coronavirus Antiviral Activity, and  J Med Chem 0:0 (2021)  
Target
Name:
Cathepsin B
Synonyms:
APP secretase CATB_HUMAN CTSB Cathepsin B light chain | Cathepsin B1
Type:
Enzyme
Mol. Mass.:
37819.69
Organism:
Homo sapiens (Human)
Description:
gi_63102437
Residue:
339
  
Inhibitor
Name:
BDBM476972
Synonyms:
SARS-CoV-2 3CLP and CoV inhibitor 15l
Type:
Small organic molecule
Emp. Form.:
C34H43N5O7
Mol. Mass.:
633.7345
SMILES:
COc1cccc2[nH]c(cc12)C(=O)N[C@@H](CC(C)C)C(=O)N[C@@H](C[C@@H]1CCCNC1=O)C(=O)COC(=O)c1c(C)cc(C)nc1C
: