Target
Replicase polyprotein 1ab
Ligand
BDBM476985
Substrate
Meas. Tech.
fluorescence resonance energy transfer (FRET)-based CoV-2 3CLpro inhibition assay
IC50
>10000±n/a nM
Citation
 Vankadara, SWong, YXLiu, BSee, YYTan, LHTan, QWWang, GKaruna, RGuo, XTan, STFong, JYJoy, JChia, CSB A head-to-head comparison of the inhibitory activities of 15 peptidomimetic SARS-CoV-2 3CLpro inhibitors. Bioorg Med Chem Lett 48:128263 (2021)  
Target
Name:
Replicase polyprotein 1ab
Synonyms:
ORF1ab polyprotein pp1ab | rep
Type:
Protein
Mol. Mass.:
794070.71
Organism:
2019-nCoV
Description:
P0DTD1
Residue:
7096
  
Inhibitor
Name:
BDBM476985
Synonyms:
MG-115
Type:
Small organic molecule
Emp. Form.:
C25H39N3O5
Mol. Mass.:
461.5943
SMILES:
CCC[C@H](NC(=O)[C@H](CC(C)C)NC(=O)[C@H](CC(C)C)NC(=O)OCc1ccccc1)C=O
: