Target
Replicase polyprotein 1ab
Ligand
BDBM479369
Substrate
Meas. Tech.
plaque reduction assay
EC50
28150±1300 nM
Citation
 Han, SHGoins, CMArya, TShin, WJMaw, JHooper, ASonawane, DPPorter, MRBannister, BECrouch, RDLindsey, AALakatos, GMartinez, SRAlvarado, JAkers, WSWang, NSJung, JUMacdonald, JDStauffer, SR Structure-Based Optimization of ML300-Derived, Noncovalent Inhibitors Targeting the Severe Acute Respiratory Syndrome Coronavirus 3CL Protease (SARS-CoV-2 3CL J Med Chem 65:2880-2904 (2021)  
Target
Name:
Replicase polyprotein 1ab
Synonyms:
ORF1ab polyprotein pp1ab | rep
Type:
Protein
Mol. Mass.:
794070.71
Organism:
2019-nCoV
Description:
P0DTD1
Residue:
7096
  
Inhibitor
Name:
BDBM479369
Synonyms:
ALP-POS-c59291d4-3 ML300-based SC inhibitor 1 | acs.jmedchem.1c00409_ST.352
Type:
Small Organic Molecule
Emp. Form.:
C23H21N5O2S
Mol. Mass.:
431.51
SMILES:
O=C(Cn1nnc2ccccc12)N(Cc1ccsc1)c1ccc(NC(=O)C2CC2)cc1
: