Target
Replicase polyprotein 1ab
Ligand
BDBM479476
Substrate
Meas. Tech.
SARS-CoV-1 and -2 3CLpro Biochemical Assay
IC50
2090±270 nM
Citation
 Han, SHGoins, CMArya, TShin, WJMaw, JHooper, ASonawane, DPPorter, MRBannister, BECrouch, RDLindsey, AALakatos, GMartinez, SRAlvarado, JAkers, WSWang, NSJung, JUMacdonald, JDStauffer, SR Structure-Based Optimization of ML300-Derived, Noncovalent Inhibitors Targeting the Severe Acute Respiratory Syndrome Coronavirus 3CL Protease (SARS-CoV-2 3CL J Med Chem 65:2880-2904 (2021)  
Target
Name:
Replicase polyprotein 1ab
Synonyms:
ORF1ab polyprotein pp1ab | rep
Type:
Protein
Mol. Mass.:
794070.71
Organism:
2019-nCoV
Description:
P0DTD1
Residue:
7096
  
Inhibitor
Name:
BDBM479476
Synonyms:
ML300-based SC inhibitor 15 | acs.jmedchem.1c00409_ST.288
Type:
Small Organic Molecule
Emp. Form.:
C24H19N5OS
Mol. Mass.:
425.506
SMILES:
O=C(Cn1nnc2ccccc12)N(Cc1ccsc1)c1ccc(cc1)-c1ccncc1
: