Target
Replicase polyprotein 1ab
Ligand
BDBM479489
Substrate
Meas. Tech.
plaque reduction assay
EC50
11140±370 nM
Citation
 Han, SHGoins, CMArya, TShin, WJMaw, JHooper, ASonawane, DPPorter, MRBannister, BECrouch, RDLindsey, AALakatos, GMartinez, SRAlvarado, JAkers, WSWang, NSJung, JUMacdonald, JDStauffer, SR Structure-Based Optimization of ML300-Derived, Noncovalent Inhibitors Targeting the Severe Acute Respiratory Syndrome Coronavirus 3CL Protease (SARS-CoV-2 3CL J Med Chem 65:2880-2904 (2021)  
Target
Name:
Replicase polyprotein 1ab
Synonyms:
ORF1ab polyprotein pp1ab | rep
Type:
Protein
Mol. Mass.:
794070.71
Organism:
2019-nCoV
Description:
P0DTD1
Residue:
7096
  
Inhibitor
Name:
BDBM479489
Synonyms:
ML300-based SC inhibitor 28
Type:
Small Organic Molecule
Emp. Form.:
C26H20ClN5O
Mol. Mass.:
453.923
SMILES:
Clc1cccc(CN(C(=O)Cn2nnc3ccccc23)c2ccc(cc2)-c2cccnc2)c1
: